1. ==> Avvio di build() in corso...
  2. coremake.c: In function ‘main’:
  3. coremake.c:5382:11: warning: ignoring return value of ‘getcwd’, declared with attribute warn_unused_result [-Wunuse d-result]
  4. coremake.c: In function ‘reader_line’:
  5. coremake.c:779:7: warning: ignoring return value of ‘fgets’, declared with attribute warn_unused_result [-Wunused-r esult]
  6. Running ./coremake gcc_linux_arm
  7. Now you can run make -C mkvalidator or gmake -C mkvalidator
  8. make: ingresso nella directory "/tmp/yaourt-tmp-francesco/aur-mkvalidator/src/mkvalidator-0.4.2/mkvalidator"
  9. make[1]: ingresso nella directory "/tmp/yaourt-tmp-francesco/aur-mkvalidator/src/mkvalidator-0.4.2/mkvalidator"
  10. make[2]: ingresso nella directory "/tmp/yaourt-tmp-francesco/aur-mkvalidator/src/mkvalidator-0.4.2/libmatroska2"
  11. make[3]: ingresso nella directory "/tmp/yaourt-tmp-francesco/aur-mkvalidator/src/mkvalidator-0.4.2/libebml2"
  12. compiling ../corec/corec/array/array.c
  13. make[3]: arm-none-linux-gnueabi-gcc: comando non trovato
  14. ebml2.mak:103: set di istruzioni per l'obiettivo "../build/gcc_linux_arm/corec/corec/array/array.ebml2.o" non riusc ito
  15. make[3]: *** [../build/gcc_linux_arm/corec/corec/array/array.ebml2.o] Errore 127
  16. make[3]: uscita dalla directory "/tmp/yaourt-tmp-francesco/aur-mkvalidator/src/mkvalidator-0.4.2/libebml2"
  17. matroska2.mak:77: set di istruzioni per l'obiettivo "../release/gcc_linux_arm/libebml2.a" non riuscito
  18. make[2]: *** [../release/gcc_linux_arm/libebml2.a] Errore 2
  19. make[2]: uscita dalla directory "/tmp/yaourt-tmp-francesco/aur-mkvalidator/src/mkvalidator-0.4.2/libmatroska2"
  20. mkvalidator.mak:79: set di istruzioni per l'obiettivo "../release/gcc_linux_arm/libmatroska2.a" non riuscito
  21. make[1]: *** [../release/gcc_linux_arm/libmatroska2.a] Errore 2
  22. make[1]: uscita dalla directory "/tmp/yaourt-tmp-francesco/aur-mkvalidator/src/mkvalidator-0.4.2/mkvalidator"
  23. GNUmakefile:6: set di istruzioni per l'obiettivo "mkvalidator" non riuscito
  24. make: *** [mkvalidator] Errore 2
  25. make: uscita dalla directory "/tmp/yaourt-tmp-francesco/aur-mkvalidator/src/mkvalidator-0.4.2/mkvalidator"
  26. ==> ERRORE: Si è verificato un errore in build().
  27. L'operazione sta per essere interrotta...
  28. ==> ERRORE: Makepkg non è riuscito a compilare mkvalidator.
  29. ==> Riavviare la compilazione di mkvalidator [s/N]

mkvalidator arm compilation error

Comments powered by Disqus