1. mingw32-make[4]: Entering directory 'c:/qt-src-5.0.1/qttools/src/qdbus/qdbus'
  2. g++ -c -pipe -fno-keep-inline-dllexport -g -fno-exceptions -frtti -Wall -Wextra -DUNICODE -DQT_NO_EXCEPTIONS -DQT_XML_LIB -DQT_DBUS_LIB -DQT_CORE_LIB -I. -I"C:\qt-src-5.0.1\qtbase\include" -I"C:\qt-src-5.0.1\qtbase\include\QtXml" -I"C:\qt-src-5.0.1\qtbase\include\QtDBus" -I"C:\qt-src-5.0.1\qtbase\include\QtDBus\5.0.1" -I"C:\qt-src-5.0.1\qtbase\include\QtDBus\5.0.1\QtDBus" -I"C:\qt-src-5.0.1\qtbase\include\QtCore" -I".moc\debug_shared" -I"C:\mingw\include" -I"C:\qt-src-5.0.1\qtbase\mkspecs\win32-g++" -o .obj\debug_shared\qdbus.o qdbus.cpp
  3. In file included from C:\qt-src-5.0.1\qtbase\include/QtDBus/qdbusmessage.h:1:0,
  4. from C:\qt-src-5.0.1\qtbase\include/QtDBus/../../src/dbus/qdbusabstractinterface.h:50,
  5. from C:\qt-src-5.0.1\qtbase\include/QtDBus/qdbusabstractinterface.h:1,
  6. from C:\qt-src-5.0.1\qtbase\include/QtDBus/QtDBus:6,
  7. from qdbus.cpp:50:
  8. C:\qt-src-5.0.1\qtbase\include/QtDBus/../../src/dbus/qdbusmessage.h:74:74: error: expected ',' or '...' before 'struct'
  9. C:\qt-src-5.0.1\qtbase\include/QtDBus/../../src/dbus/qdbusmessage.h:77:57: error: expected ',' or '...' before 'struct'
  10. C:\qt-src-5.0.1\qtbase\include/QtDBus/../../src/dbus/qdbusmessage.h:96:22: error: expected identifier before '(' token
  11. C:\qt-src-5.0.1\qtbase\include/QtDBus/../../src/dbus/qdbusmessage.h:96:23: error: expected unqualified-id before ')' token
  12. In file included from C:\qt-src-5.0.1\qtbase\include/QtDBus/qdbusconnection.h:1:0,
  13. from C:\qt-src-5.0.1\qtbase\include/QtDBus/../../src/dbus/qdbusabstractinterface.h:52,
  14. from C:\qt-src-5.0.1\qtbase\include/QtDBus/qdbusabstractinterface.h:1,
  15. from C:\qt-src-5.0.1\qtbase\include/QtDBus/QtDBus:6,
  16. from qdbus.cpp:50:
  17. C:\qt-src-5.0.1\qtbase\include/QtDBus/../../src/dbus/qdbusconnection.h:152:78: error: expected ',' or '...' before 'struct'
  18. C:\qt-src-5.0.1\qtbase\include/QtDBus/../../src/dbus/qdbusconnection.h:154:78: error: expected ',' or '...' before 'struct'
  19. C:\qt-src-5.0.1\qtbase\include/QtDBus/../../src/dbus/qdbusconnection.h:154:10: error: 'bool QDBusConnection::connect(const QString&, const QString&, const QString&)' cannot be overloaded
  20. C:\qt-src-5.0.1\qtbase\include/QtDBus/../../src/dbus/qdbusconnection.h:152:10: error: with 'bool QDBusConnection::connect(const QString&, const QString&, const QString&)'
  21. C:\qt-src-5.0.1\qtbase\include/QtDBus/../../src/dbus/qdbusconnection.h:157:78: error: expected ',' or '...' before 'struct'
  22. C:\qt-src-5.0.1\qtbase\include/QtDBus/../../src/dbus/qdbusconnection.h:157:10: error: 'bool QDBusConnection::connect(const QString&, const QString&, const QString&)' cannot be overloaded
  23. C:\qt-src-5.0.1\qtbase\include/QtDBus/../../src/dbus/qdbusconnection.h:152:10: error: with 'bool QDBusConnection::connect(const QString&, const QString&, const QString&)'
  24. C:\qt-src-5.0.1\qtbase\include/QtDBus/../../src/dbus/qdbusconnection.h:161:81: error: expected ',' or '...' before 'struct'
  25. C:\qt-src-5.0.1\qtbase\include/QtDBus/../../src/dbus/qdbusconnection.h:163:81: error: expected ',' or '...' before 'struct'
  26. C:\qt-src-5.0.1\qtbase\include/QtDBus/../../src/dbus/qdbusconnection.h:163:10: error: 'bool QDBusConnection::disconnect(const QString&, const QString&, const QString&)' cannot be overloaded
  27. C:\qt-src-5.0.1\qtbase\include/QtDBus/../../src/dbus/qdbusconnection.h:161:10: error: with 'bool QDBusConnection::disconnect(const QString&, const QString&, const QString
  28. &)'
  29. C:\qt-src-5.0.1\qtbase\include/QtDBus/../../src/dbus/qdbusconnection.h:166:81: error: expected ',' or '...' before 'struct'
  30. C:\qt-src-5.0.1\qtbase\include/QtDBus/../../src/dbus/qdbusconnection.h:166:10: error: 'bool QDBusConnection::disconnect(const QString&, const QString&, const QString&)' cannot be overloaded
  31. C:\qt-src-5.0.1\qtbase\include/QtDBus/../../src/dbus/qdbusconnection.h:161:10: error: with 'bool QDBusConnection::disconnect(const QString&, const QString&, const QString
  32. &)'
  33. C:\qt-src-5.0.1\qtbase\include/QtDBus/../../src/dbus/qdbusconnection.h:181:31: error: expected unqualified-id before 'struct'
  34. C:\qt-src-5.0.1\qtbase\include/QtDBus/../../src/dbus/qdbusconnection.h:181:30: error: expected ';' at end of member declaration
  35. C:\qt-src-5.0.1\qtbase\include/QtDBus/../../src/dbus/qdbusconnection.h:181:40: error: expected identifier before '(' token
  36. C:\qt-src-5.0.1\qtbase\include/QtDBus/../../src/dbus/qdbusconnection.h:181:41: error: expected unqualified-id before ')' token
  37. In file included from C:\qt-src-5.0.1\qtbase\include/QtDBus/qdbusabstractinterface.h:1:0,
  38. from C:\qt-src-5.0.1\qtbase\include/QtDBus/QtDBus:6,
  39. from qdbus.cpp:50:
  40. C:\qt-src-5.0.1\qtbase\include/QtDBus/../../src/dbus/qdbusabstractinterface.h:93:22: error: expected identifier before '(' token
  41. C:\qt-src-5.0.1\qtbase\include/QtDBus/../../src/dbus/qdbusabstractinterface.h:93:23: error: expected unqualified-id before ')' token
  42. C:\qt-src-5.0.1\qtbase\include/QtDBus/../../src/dbus/qdbusabstractinterface.h:145:85: error: expected ',' or '...' before 'struct'
  43. In file included from C:\qt-src-5.0.1\qtbase\include/QtDBus/qdbusinterface.h:1:0,
  44. from C:\qt-src-5.0.1\qtbase\include/QtDBus/QtDBus:13,
  45. from qdbus.cpp:50:
  46. C:\qt-src-5.0.1\qtbase\include/QtDBus/../../src/dbus/qdbusinterface.h:63:80: error: expected ',' or '...' before 'struct'
  47. qdbus.cpp: In function 'void listObjects(const QString&, const QString&)':
  48. qdbus.cpp:120:83: error: no matching function for call to 'QDBusMessage::createMethodCall(const QString&, const QString, QLatin1String, QLatin1String)'
  49. qdbus.cpp:120:83: note: candidate is:
  50. In file included from C:\qt-src-5.0.1\qtbase\include/QtDBus/qdbusmessage.h:1:0,
  51. from C:\qt-src-5.0.1\qtbase\include/QtDBus/../../src/dbus/qdbusabstractinterface.h:50,
  52. from C:\qt-src-5.0.1\qtbase\include/QtDBus/qdbusabstractinterface.h:1,
  53. from C:\qt-src-5.0.1\qtbase\include/QtDBus/QtDBus:6,
  54. from qdbus.cpp:50:
  55. C:\qt-src-5.0.1\qtbase\include/QtDBus/../../src/dbus/qdbusmessage.h:76:25: note: static QDBusMessage QDBusMessage::createMethodCall(const QString&, const QString&, const QString&)
  56. C:\qt-src-5.0.1\qtbase\include/QtDBus/../../src/dbus/qdbusmessage.h:76:25: note: candidate expects 3 arguments, 4 provided
  57. qdbus.cpp: At global scope:
  58. qdbus.cpp:154:87: error: expected ',' or '...' before 'struct'
  59. qdbus.cpp: In function 'void listInterface(const QString&, const QString&, const QString&)':
  60. qdbus.cpp:156:41: error: expected primary-expression before 'struct'
  61. qdbus.cpp:160:17: error: expected primary-expression before '(' token
  62. qdbus.cpp:160:17: error: expected primary-expression before 'struct'
  63. qdbus.cpp:178:46: error: expected primary-expression before '(' token
  64. qdbus.cpp:178:46: error: expected primary-expression before 'struct'
  65. qdbus.cpp:191:16: error: expected primary-expression before '(' token
  66. qdbus.cpp:191:16: error: expected primary-expression before 'struct'
  67. qdbus.cpp: In function 'void listAllInterfaces(const QString&, const QString&)':
  68. qdbus.cpp:213:83: error: no matching function for call to 'QDBusMessage::createMethodCall(const QString&, const QString, QLatin1String, QLatin1String)'
  69. qdbus.cpp:213:83: note: candidate is:
  70. In file included from C:\qt-src-5.0.1\qtbase\include/QtDBus/qdbusmessage.h:1:0,
  71. from C:\qt-src-5.0.1\qtbase\include/QtDBus/../../src/dbus/qdbusabstractinterface.h:50,
  72. from C:\qt-src-5.0.1\qtbase\include/QtDBus/qdbusabstractinterface.h:1,
  73. from C:\qt-src-5.0.1\qtbase\include/QtDBus/QtDBus:6,
  74. from qdbus.cpp:50:
  75. C:\qt-src-5.0.1\qtbase\include/QtDBus/../../src/dbus/qdbusmessage.h:76:25: note: static QDBusMessage QDBusMessage::createMethodCall(const QString&, const QString&, const QString&)
  76. C:\qt-src-5.0.1\qtbase\include/QtDBus/../../src/dbus/qdbusmessage.h:76:25: note: candidate expects 3 arguments, 4 provided
  77. qdbus.cpp: At global scope:
  78. qdbus.cpp:257:82: error: expected ',' or '...' before 'struct'
  79. qdbus.cpp: In function 'int placeCall(const QString&, const QString&, const QString&)':
  80. qdbus.cpp:260:41: error: expected primary-expression before 'struct'
  81. qdbus.cpp:267:24: error: 'arguments' was not declared in this scope
  82. qdbus.cpp:271:28: error: 'member' was not declared in this scope
  83. qdbus.cpp:288:22: error: 'try_prop' was not declared in this scope
  84. qdbus.cpp:290:21: error: 'try_prop' was not declared in this scope
  85. qdbus.cpp:292:32: error: expected primary-expression before 'struct'
  86. qdbus.cpp:292:32: error: expected ';' before 'struct'
  87. qdbus.cpp:295:107: error: too many arguments to function 'int placeCall(const QString&, const QString&, const QString&)'
  88. qdbus.cpp:257:12: note: declared here
  89. qdbus.cpp:299:25: error: expected primary-expression before '(' token
  90. qdbus.cpp:299:25: error: expected primary-expression before 'struct'
  91. qdbus.cpp:380:67: error: 'member' was not declared in this scope
  92. qdbus.cpp:385:14: error: 'try_prop' was not declared in this scope
  93. qdbus.cpp:387:56: error: 'try_prop' was not declared in this scope
  94. qdbus.cpp:389:24: error: expected primary-expression before 'struct'
  95. qdbus.cpp:389:24: error: expected ';' before 'struct'
  96. qdbus.cpp:391:99: error: too many arguments to function 'int placeCall(const QString&, const QString&, const QString&)'
  97. qdbus.cpp:257:12: note: declared here
  98. qdbus.cpp: In function 'int main(int, char**)':
  99. qdbus.cpp:482:48: error: expected unqualified-id before 'struct'
  100. qdbus.cpp:482:48: error: expected ',' or ';' before 'struct'
  101. qdbus.cpp:513:13: error: expected primary-expression before 'struct'
  102. qdbus.cpp:513:13: error: expected ';' before 'struct'
  103. qdbus.cpp:515:15: error: expected primary-expression before 'struct'
  104. qdbus.cpp:515:15: error: expected ',' or ';' before 'struct'
  105. qdbus.cpp:517:18: error: expected primary-expression before 'struct'
  106. qdbus.cpp:517:18: error: expected ';' before 'struct'
  107. qdbus.cpp:518:9: error: expected primary-expression before 'struct'
  108. qdbus.cpp:518:9: error: expected ';' before 'struct'
  109. qdbus.cpp:520:18: error: expected primary-expression before 'struct'
  110. qdbus.cpp:520:18: error: expected ';' before 'struct'
  111. qdbus.cpp:521:9: error: expected primary-expression before 'struct'
  112. qdbus.cpp:521:9: error: expected ';' before 'struct'
  113. qdbus.cpp:523:10: error: expected primary-expression before 'struct'
  114. qdbus.cpp:523:10: error: expected ')' before 'struct'
  115. qdbus.cpp:524:76: error: expected primary-expression before '(' token
  116. qdbus.cpp:524:76: error: expected primary-expression before 'struct'
  117. qdbus.cpp:532:40: error: expected primary-expression before 'struct'
  118. Makefile.Debug:549: recipe for target '.obj/debug_shared/qdbus.o' failed
  119. mingw32-make[4]: *** [.obj/debug_shared/qdbus.o] Error 1
  120. mingw32-make[4]: Leaving directory 'c:/qt-src-5.0.1/qttools/src/qdbus/qdbus'
  121. Makefile:34: recipe for target 'debug' failed
  122. mingw32-make[3]: *** [debug] Error 2
  123. mingw32-make[3]: Leaving directory 'c:/qt-src-5.0.1/qttools/src/qdbus/qdbus'
  124. Makefile:39: recipe for target 'sub-qdbus-make_first' failed
  125. mingw32-make[2]: *** [sub-qdbus-make_first] Error 2
  126. mingw32-make[2]: Leaving directory 'c:/qt-src-5.0.1/qttools/src/qdbus'
  127. Makefile:258: recipe for target 'sub-qdbus-make_first-ordered' failed
  128. mingw32-make[1]: *** [sub-qdbus-make_first-ordered] Error 2
  129. mingw32-make[1]: Leaving directory 'c:/qt-src-5.0.1/qttools/src'
  130. makefile:40: recipe for target 'sub-src-make_first' failed
  131. mingw32-make: *** [sub-src-make_first] Error 2
  132. c:\qt-src-5.0.1\qttools>
Comments powered by Disqus